Titre,TitreBlogue,Extrait,Catégorie,"Type de document","Catégorie Hess",Enjeu,"Action du type",Résultat,"URL de l'article","Catégorie d'article","Date de modification","Date de dernière modification"
"Seeds of Freedom",,,"Catégorie:Objet média",Vidéo,"Seeds Commons,Semences Communes,Biodiversité","Semences,Brevets,Propriété intellectuelle,Souveraineté alimentaire",,,,,"11 mars 2024",
"Seeing the Forest",,,"Catégorie:Objet média",Vidéo,"Paysages,Forêts,Agriculture,Biodiversité","Communauté,Engagement citoyen,Préservation,Responsabilité des communs",,,,,"14 mai 2019",
"Série de podcasts sur la ressource en eau « Entre Rhône et Saône »",,,"Catégorie:Objet média",Multimédia,"Gouvernance des ressources naturelles,Cycle de l'eau","Changement climatique,Biodiversité","Gestion durable",,,,"6 juin 2024",
Shakirail,,,"Catégorie:Objet média",Fiche,"Espace de travail,Squat,Conditions de travail","Condition des artistes","Autogestion,Occupations éphémères,Occupation",,,,"21 novembre 2017",
"Shieldhill and California UOG Community Discussion Outcomes",,,"Catégorie:Objet média",Texte,"Démocratie participative,Démocratie locale","Socio-ecological Memory",,Preservation,,,"22 janvier 2018",
"Sortir de l'entre soi - entretiens filmés",,,Catégorie:Projet,,"Travail,Écologie,Participation démocratique",,Co-apprentissage,,,,"2 mai 2024",
"Soutien aux communs, l'approche de femProcomuns",,,"Catégorie:Objet média",Article,,,,,,,"24 août 2022",
"St Ives Community Charter",,,"Catégorie:Objet média",Texte,"Cultural commons","Démocratie participative","Cartographie,Tactical chartering,Charte","Communs de voisinage",,,"13 août 2019",
"Stefano Rodotà lors du Séminaire Communs de la nature et des connaissances ISCC",,,"Catégorie:Objet média",Audio,"Patrimoine culturel,Eau,Biens communs culturels","Statuts juridiques,Institutionnalisation des communs","Référendum sur l'eau,Commission Rodotà","Communs de voisinage",,,"13 janvier 2019",
Straddle3,,,Catégorie:Mouvement,,,,,,,,"13 novembre 2017",
SubmersionS,,,"Catégorie:Objet média",Vidéo,"Littoral,Trait de cote","Territoire,Milieu marin","Culture du risque","Justice environnementale",,,"18 février 2019",
"Table ronde des économistes français à Berlin",,,"Catégorie:Objet média",Vidéo,"Communs sociaux","Communs et État,Récupération des biens communs,Communs et marché,Passage à l'échelle,Coalition des communs,Droit des communs",,,,,"24 novembre 2020",
"Tactical Chartering Manifesto",,,"Catégorie:Objet média",Fiche,,,,,,,"12 décembre 2018",
"Tension entre public et communs",,,"Catégorie:Objet média",Audio,"Éducation,Transport,Service de santé publique,Domaine public","Communs et État",,,,,"10 février 2017",
"Terrain à NE PAS vendre - Community Land Trust à Bruxelles",,,"Catégorie:Objet média",Vidéo,"Foncier,Foncier urbain,Bien immobilier,Logement","Propriété collective,Mixité sociale","Habitat partagé / habitat communautaire,Community Land Trust,Fiducie foncière communautaire","Communs de voisinage",,,"22 février 2019",
"Terrra Brezoï",,,Catégorie:Projet,,"Espace de création","Résilience agro-écologique",Auto-organisation,,,,"16 janvier 2023",
Chargement/Site#_0e9580c3fafb6b1e20f425f230699ad4,"Glossary Of The Commons, First Experiments",,,,,,,,,"Non classifié(e),Projets passés et présents,Vidéos",,"2 novembre 2020"
Chargement/Site#_0ff7c3d37a62512c34b2077a9935100b,"Quelles stratégies pour défendre les lieux en communs ?",,,,"Biens communs",,,"Partage de connaissances",,"Articles,Non classifié(e)",,"19 octobre 2021"
Chargement/Site#_1010cc33c59d62b4bf0788413c3d2696,"Bénin bien commun",,,,,,,,,"Non classifié(e),Projets passés et présents,Vidéos",,"7 décembre 2019"
Chargement/Site#_111155724db6b04b8c64d19114865ac5,"Droits en Biens Communs",,,,,,,,,"Uncategorized,Projets passés et présents",,"4 février 2021"
Chargement/Site#_111b9614d3ed2d7606237596e6b8de04,"Cartographier les Communs en Afrique",,,,"Biens communs",,,"Partage de connaissances",,"Non classifié(e),Entrevues,Projets passés et présents,Ressources",,"4 février 2021"
Chargement/Site#_11f88c11dcc2801dce6204bfae885738,"Définir les biens communs #1",,,,,,,,,"Projets complétés,Projets passés et présents,Vidéos",,"26 août 2020"
Chargement/Site#_12fb48d9f82cf170c2b2799e67702845,"Montréal, premier rendez-vous A l’école des communs.",,,,,,,,,"Projets complétés,Projets passés et présents",,"30 août 2020"
Chargement/Site#_143b545486db85ff042ac3349f59300c,"Bibliographies sur les communs avec Zotero",,,,,,,,,"Outils,Ressources",,"24 août 2022"
Chargement/Site#_14d9cf8a3eb32dcba9c06dbc28673b8b,"Remix Biens Communs à la Bibliothèque Nationale de France",,,,,,,,,"Projets complétés,Projets passés et présents,Vidéos",,"4 février 2021"
Chargement/Site#_1604d9fe3f6063458c0a75055a70635f,"La terre de l’autre – Interviews d’Étienne Le Roy",,,,,,,,,"Entrevues,Vidéos",,"4 février 2021"
Chargement/Site#_1705a85bd577f6cd92aa5a9f42c3ae88,"European Commons Assembly Meet At Medialab Prado",,,,"Biens communs",,,"Partage de connaissances",,"Uncategorized,Projets passés et présents",,"2 novembre 2020"
Chargement/Site#_17a13e9c5c4da47ac6d902a039f85074,"Define The Commons #3",,,,,,,,,"Uncategorized,Projets passés et présents,Vidéos",,"4 février 2021"
Chargement/Site#_184ecd4a0f20a278f9904dca2c89c44d,"À l’école des communs",,,,,,,,,"Non classifié(e),Projets passés et présents",,"4 février 2021"
Chargement/Site#_1854650e36a9d8fb1d449496351c554a,"Petits Déjeuners en-Commun au Sénégal",,,,,,,,,"Uncategorized,Projets passés et présents",,"4 février 2021"
Chargement/Site#_18b78b682846be565a76bd7037d38087,"De nouvelles vidéos pour explorer le potentiel politique des communs",,,,"Biens communs",,,"Partage de connaissances",,"Dossiers,Non classifié(e),Ressources",,"18 octobre 2021"
Chargement/Site#_18e3b71c130276252a753b225a2537fa,"Communs et éducation populaire, partage d’expérience et perspectives",,,,,,,,,"Non classifié(e),Vidéos",,"7 décembre 2019"
Chargement/Site#_1a92bd3fad143215932c87d82963714f,"Définir les biens communs #2",,,,,,,,,"Projets complétés,Projets passés et présents,Vidéos",,"26 août 2020"
Chargement/Site#_1ae3bf9713e63958f4a61ef098a51027,"C@rtes en Commun : Apprendre sur les communs en jouant",,,,"Biens communs",,,"Partage de connaissances",,"Non classifié(e),Outils,Ressources",,"27 décembre 2020"
Chargement/Site#_1bd4459a578fb7265c0cad8a856bc7d5,"Mapping the commons",,,,,,,,,"Non classifié(e),Projets passés et présents,Vidéos",,"7 décembre 2019"
Chargement/Site#_1cf5b18cca27bfddf1ec7d7322b7bccf,"Commons Enter City Hall (1)",,,,"Biens communs",,,"Partage de connaissances",,"Analysis,Ressources,Vidéos",,"4 février 2021"
Chargement/Site#_1e5e8256209edda1420516319417354b,"Define The Commons #2",,,,,,,,,"Uncategorized,Projets passés et présents,Vidéos",,"2 novembre 2020"
Chargement/Site#_1f665425cd72c32a301ccf340aabbd8b,"Tous commoners",,,,,,,,,"Non classifié(e),Entrevues,Projets passés et présents",,"22 février 2021"
Chargement/Site#_1fd98a1509b070bead71bf2ce9ef9e99,"Définir les biens communs #5",,,,,,,,,"Projets complétés,Projets passés et présents,Vidéos",,"4 février 2021"
Chargement/Site#_213c7aeb51d22f6125060ba28fa2b52c,"Définir les biens communs #4",,,,,,,,,"Projets complétés,Projets passés et présents,Vidéos",,"4 février 2021"
Chargement/Site#_2220716cfdbb170d33a593d9cdd9cae9,"Partager le vocabulaire des communs",,,,"Biens communs",,,"Partage de connaissances",,"Outils,Ressources",,"6 août 2021"
Chargement/Site#_246d2e0ea205fb5a806fb7a13225c93f,"Economie et/des Communs : deux nouvelles collections vidéo",,,,,,,,,"Collections,Ressources,Vidéos",,"8 février 2021"
Chargement/Site#_24e4d258d38e0e185f0cf88a09ab804c,"Itinéraires en Biens Communs",,,,,,,,,"Uncategorized,Projets passés et présents",,"4 février 2021"
Chargement/Site#_26a45c09e4a62771901357f9f4b3018f,"Art of commoning",,,,"Biens communs",,,"Partage de connaissances",,"Uncategorized,Projets complétés,Projets passés et présents,Ressources",,"4 février 2021"
Chargement/Site#_2717f70743a22605c2873f7e22f8dc4d,"Les communs à l’ordre du jour planétaire",,,,,,,,,"Dossiers,Projects,Projects completed",,"24 février 2021"
Chargement/Site#_27df639885d44bf74825bf1421fc874f,"Conversation entre Bernard Stiegler et Michel Bauwens sur la transition basée sur les communs",,,,"Biens communs",,,"Partage de connaissances",,"Non classifié(e),Projets complétés,Projets passés et présents,Ressources",,"4 février 2021"
Chargement/Site#_2945619cc8e3d9b6740a34691d6f72cd,"Droits en Biens Communs",,,,,,,,,"Projets complétés,Projets passés et présents",,"4 février 2021"
Chargement/Site#_2c844d5b3dff46ee2a96522a57899740,"À l’école des communs",,,,,,,,,"Uncategorized,Projets passés et présents",,"4 février 2021"
Chargement/Site#_2e7997f2d3b41c2fc6def75ba3e54872,"Sacred Economics avec Charles Eisenstein – Un court métrage",,,,,,,,,"Uncategorized,Vidéos,Projets passés et présents",,"30 août 2020"
Chargement/Site#_2f96f4f8b97a66d4e90bfd2cfed6eba7,"Les déjeuners des Communs de Montréal",,,,,,,,,"Uncategorized,Projets complétés,Projets passés et présents",,"30 août 2020"
