Titre,TitreBlogue,Extrait,Catégorie,"Type de document","Catégorie Hess",Enjeu,"Action du type",Résultat,"URL de l'article","Catégorie d'article","Date de modification","Date de dernière modification"
Chargement/Site#_2fdba4ade38446b7fbce9ac443ba3d6f,"Prix de la Banque royale de Suède en sciences économiques en mémoire d’Alfred Nobel",,,,,,,,,"Non classifié(e),Projets passés et présents",,"30 août 2020"
Chargement/Site#_3221a7d80b29639641c87d00004d1ef6,"Conversation entre Bernard Stiegler et Michel Bauwens sur la transition basée sur les communs",,,,"Biens communs",,,"Partage de connaissances",,"Uncategorized,Projets complétés,Projets passés et présents,Ressources",,"4 février 2021"
Chargement/Site#_3304c85d5215a9d48fe44b8db3ad406b,"Michel Bauwens – « En route vers de nouveaux territoires économiques » 3/4",,,,,,,,,"Non classifié(e),Projets passés et présents,Vidéos",,"30 août 2020"
Chargement/Site#_3550946428672b68b39187f839462a88,"La terre de l’autre – Interviews Of Étienne Le Roy",,,,,,,,,"Interviews,Videos",,"15 janvier 2022"
Chargement/Site#_358813c6107fb16b41d5d810f2722f3f,"Les communs à l’ordre du jour planétaire",,,,,,,,,"Dossiers,Projets complétés,Projets passés et présents",,"4 février 2021"
Chargement/Site#_35b5c5393a899e2e0dc1c51837febf23,"Konbit numérique",,,,"Biens communs",,,"Partage de connaissances",,"Outils,Projets passés et présents",,"16 janvier 2021"
Chargement/Site#_367916d6b58f98160e9c19bc254c2720,"Hosting the Commons",,,,,,,,,"Non classifié(e),Vidéos",,"7 décembre 2019"
Chargement/Site#_375f991bffcb12398d7fb9d67d849e06,"Sharing The Vocabulary Of The Commons",,,,"Biens communs",,,"Partage de connaissances",,"Analysis,Outils,Ressources",,"4 février 2021"
Chargement/Site#_386c18fe877149d36d2bd7aee477a180,"Les Communs entrent à l’Hotel de Ville (1)",,,,"Biens communs",,,"Partage de connaissances",,"Articles,Ressources,Vidéos",,"4 février 2021"
Chargement/Site#_388eec97c18f68b7e74799a741155485,"Tragedies, comedies and other dramas of the Commons by Bonnie McCay #IASC #Japan2013",,,,,,,,,"Uncategorized,Projets passés et présents,Vidéos",,"4 février 2021"
Chargement/Site#_391b44eaa62423d592557b171eef3d00,"Glossary Of The Commons, First Experiments",,,,,,,,,"Non classifié(e),Projets passés et présents,Vidéos",,"2 novembre 2020"
Chargement/Site#_3978d83cab391617617f976eedef67cb,"Prochainement : Assemblée européenne des communs",,,,"Biens communs",,,"Partage de connaissances",,"Non classifié(e),Ressources",,"7 décembre 2019"
Chargement/Site#_39805eaa3a9d064b10fa650a9da8c9c5,"Mapping the commons",,,,,,,,,"Uncategorized,Projets passés et présents,Vidéos",,"14 janvier 2020"
Chargement/Site#_39bf5c28290d5ad8bd747dc1be8c5ab0,"Mapping The Commons In Africa",,,,"Biens communs",,,"Partage de connaissances",,"Uncategorized,Entrevues,Projets passés et présents,Ressources",,"4 février 2021"
Chargement/Site#_3b95df8396248a389e42154683b7fede,"La terre de l’autre – Interviews Of Étienne Le Roy",,,,,,,,,"Interviews,Videos",,"15 janvier 2022"
Chargement/Site#_3caf812c8db0fa3f5d7654d6f538e299,"Barcelone en Commun : bilans avant la prochaine étape, l’exemple du Plan Numérique",,,,"Biens communs",,,"Partage de connaissances",,"Articles,Projets passés et présents",,"4 février 2021"
Chargement/Site#_3e31f3f1c473d8e1c54006d6290823fd,"Refuser de financer la recherche vaccinale en «double aveugle»",,,,"Biens communs",,,"Partage de connaissances",,"Articles,Ressources",,"24 février 2021"
Chargement/Site#_3f15fdb511a0029811d89f184fbf5e0a,"FLOK Society, A Research Project For The Transition In Ecuador",,,,,,,,,"Uncategorized,Projets passés et présents,Vidéos",,"2 novembre 2020"
Chargement/Site#_402f9f28a09d408a96a1bff5bc51e4a3,"Droits en Biens Communs",,,,,,,,,"Uncategorized,Projets passés et présents",,"4 février 2021"
Chargement/Site#_411e8bf61b798e2bb1da4daf59f27e06,"Remix Biens Communs présenté sur Revista Pillku",,,,,,,,,"Uncategorized,Projets passés et présents",,"30 août 2020"
Chargement/Site#_42ac4714c19b366e9029438bb82fbb82,Cecosesola,,,,"Biens communs",,,"Partage de connaissances",,"Uncategorized,Projets complétés,Projets passés et présents,Ressources",,"4 février 2021"
Chargement/Site#_432a085a00758e2f54192e1305c650a1,"Chartes de gouvernance",,,,,,,,,"Non classifié(e),Projets passés et présents",,"4 février 2021"
Chargement/Site#_441751b71a2024f3f62e341456b893f1,"Define The Commons In The Map",,,,,,,,,"Uncategorized,Vidéos",,"2 novembre 2020"
Chargement/Site#_4893b10e669d4abb5cef72a0a74b3f93,"Public Debate : « For The Transition, A Sharing Knowledge And Commons Economy »",,,,"Biens communs",,,"Partage de connaissances",,"Uncategorized,Projets complétés,Projets passés et présents,Ressources",,"4 février 2021"
Chargement/Site#_48edf5d62098d287c6a436222c30396a,"Atlas des chartes des communs urbains",,,,"Biens communs",,,"Partage de connaissances",,"Projets complétés,Projets passés et présents",,"8 février 2021"
Chargement/Site#_4a5625bf6019e29a84120721bd08148d,"Economie et/des Communs : deux nouvelles collections vidéo",,,,,,,,,"Collections,Ressources,Vidéos",,"8 février 2021"
Chargement/Site#_4a5df4222412b07550698273ccd0d25d,"Prendre soin ensemble",,,,"Biens communs",,,"Partage de connaissances",,"Dossiers,Ressources",,"24 août 2022"
Chargement/Site#_4a89f8326da25558eacafa2f54c4913a,"Define The Commons #1",,,,,,,,,"Uncategorized,Projets passés et présents,Vidéos",,"2 novembre 2020"
Chargement/Site#_4d601bc8462468b4ac5530d8b9e6d82b,"Stop, Thief!: The Commons, Enclosures, and Resistance (PM Press)",,,,,,,,,"Uncategorized,Vidéos",,"4 février 2021"
Chargement/Site#_4e20f3c97619e2fbacaf107359250026,"New collections of videos  Economy and Commons",,,,,,,,,"Collections,Projets passés et présents",,"8 février 2021"
Chargement/Site#_4ee8831c22dd2fc59448022b21e4c352,"La promesse du « Coopérativisme ouvert » par David Bollier",,,,"Biens communs",,,"Partage de connaissances",,"Articles,Projets complétés,Projets passés et présents,Ressources",,"4 février 2021"
Chargement/Site#_4fb4accace427a3a1a4064959cc6ae8a,"New collections of videos  Economy and Commons",,,,,,,,,"Collections,Projets passés et présents",,"8 février 2021"
Chargement/Site#_5047ca7d2e35b0ba0d9f765bb977a470,"« Jusqu’où tu es chez toi ? » Petit déjeuner en Commun à Kédougou",,,,,,,,,"Non classifié(e),Projets passés et présents",,"7 décembre 2019"
Chargement/Site#_5138c00eadda2acbd44d8d0076106e06,"Hommage à Silke Helfrich (1967 – 2021)",,,,"Biens communs",,,"Partage de connaissances",,"Articles,Ressources",,"24 août 2022"
Chargement/Site#_51533590eb799594efddbdd0f16b2334,,,,,"Biens communs",,,"Partage de connaissances",,,,
Chargement/Site#_51b99aa332a5aed801e9d5248b1b3b05,"Stop, Thief!: The Commons, Enclosures, and Resistance (PM Press)",,,,,,,,,"Uncategorized,Vidéos",,"4 février 2021"
Chargement/Site#_5361ddf878076d8c26244d1879b100e8,"Barcelone à la croisée des communs",,,,"Biens communs",,,"Partage de connaissances",,"Non classifié(e),Projets passés et présents",,"7 décembre 2019"
Chargement/Site#_5470369f2476c8b8fa30ff7acc3a68ee,"Revendiquer les Communs – Nourriture pour tous à Haultain Boulevard",,,,,,,,,"Entrevues,Vidéos,Projets passés et présents",,"30 août 2020"
Chargement/Site#_56095547bb337d4eca92bb94bc60f797,"An Exhibition On The Commons",,,,"Biens communs",,,"Partage de connaissances",,"Projects,Projects completed,Resources,Tools",,"22 janvier 2022"
Chargement/Site#_56570d821696e6acbcf614ac9e63bac2,"Elinor Ostrom partage sa vision sur l’IASC",,,,,,,,,"Entrevues,Projets passés et présents",,"2 novembre 2020"
Chargement/Site#_5791b539ba432dffd29484f2bf7bc042,"Media And Transition, A Debate In the Goethe-Institut",,,,"Biens communs",,,"Partage de connaissances",,"Uncategorized,Ressources,Vidéos",,"2 novembre 2020"
Chargement/Site#_57fc468c47ac7c8a7769cc43d3ee02ed,"Atlas des chartes des communs urbains",,,,"Biens communs",,,"Partage de connaissances",,"Articles,Projets complétés,Projets passés et présents,Ressources",,"4 février 2021"
Chargement/Site#_580ad4a4abab2983604c73ce63c60fae,"Sortie : Sud Eau Nord Déplacer",,,,"Biens communs",,,"Partage de connaissances",,"Non classifié(e),Projets complétés,Projets passés et présents,Ressources",,"26 août 2020"
Chargement/Site#_581783fa09b1d5d2f3f3b3ee9d71929a,"C@rds In Commons, Place Your Order!",,,,"Biens communs",,,"Partage de connaissances",,"Uncategorized,Ressources",,"2 novembre 2020"
Chargement/Site#_5ad452da342ad0d6581fae40f018c5a5,"Justice transitionnelle: l’expérience Marocaine",,,,,,,,,"Projets complétés,Projets passés et présents,Vidéos",,"27 août 2020"
Chargement/Site#_5b07c02919d8fcd8ca265abcfbadeab8,"Justice transitionnelle: l’expérience Marocaine",,,,,,,,,"Uncategorized,Projets passés et présents,Vidéos",,"14 janvier 2020"
Chargement/Site#_5cfad790f872aa7b5b3538f76db247d2,"Définir les communs sur une carte",,,,,,,,,"Projets complétés,Projets passés et présents",,"27 août 2020"
Chargement/Site#_5da337c70e5696c36deb2c16be1ea605,"Pêche durable en Méditarranée",,,,,,,,,Vidéos,,"4 février 2021"
Chargement/Site#_5df9e16c381ca5860695876130b128b6,"Les déjeuners des Communs de Montréal",,,,,,,,,"Projets complétés,Projets passés et présents",,"30 août 2020"
Chargement/Site#_5e0297b4fdbb6c80c0b6f736acee6ab1,"Culture, communauté, et collaboration: nouvelles pistes pour la protection du patrimoine autochtone",,,,,,,,,Uncategorized,,"4 février 2021"
