Titre,TitreBlogue,Extrait,Catégorie,"Type de document","Catégorie Hess",Enjeu,"Action du type",Résultat,"URL de l'article","Catégorie d'article","Date de modification","Date de dernière modification"
Chargement/Site#_5e56f6435e490c9db5ecfa81169b873e,"Les voies maritimes",,,,"Biens communs",,,"Partage de connaissances",,"Non classifié(e),Projets complétés,Projets passés et présents,Ressources",,"30 août 2020"
Chargement/Site#_5ebddfbbd7f24bd11537340c92cb790d,"Pêche durable en Méditarranée",,,,,,,,,Vidéos,,"4 février 2021"
Chargement/Site#_5f75f586298077462a0f51dd95f22297,"Marianne Knuth, founder of Kafunda Village",,,,,,,,,Uncategorized,,"4 février 2021"
Chargement/Site#_61698a933fd8ba260a70d31b90e0c025,"Chartes de gouvernance",,,,,,,,,"Uncategorized,Projets passés et présents",,"4 février 2021"
Chargement/Site#_6244d49d70e3bb16912a9f8759c56bdf,"Elinor Ostrom sharing her vision of IASC",,,,,,,,,"Uncategorized,Projets passés et présents",,"2 novembre 2020"
Chargement/Site#_62a78118c01232d7397f4097afb07c1e,"Appel en commun",,,,"Biens communs",,,"Partage de connaissances",,"Projets en cours,Projets passés et présents",,"15 janvier 2022"
Chargement/Site#_64374d56116a0f26f4059293ef067846,,,,,"Biens communs",,,"Partage de connaissances",,,,
Chargement/Site#_644c8915b4e594c6bcc080b9a0669f9d,,,,,"Biens communs",,,"Partage de connaissances",,,,
Chargement/Site#_646edb9a65df2e9bba4806eebf1225be,,,,,,,,,,,,
Chargement/Site#_64eae7ba6fb1a6ae821e27d094aa9b48,"Land Rush",,,,"Biens communs",,,"Partage de connaissances",,"Non classifié(e),Projets complétés,Projets passés et présents,Ressources",,"4 février 2021"
Chargement/Site#_65f4265b8578b94cb5e1e6d6246cec43,"Assemblée des communs #1",,,,"Biens communs",,,"Partage de connaissances",,"Projets en cours,Projets passés et présents",,"24 août 2022"
Chargement/Site#_6605ec2370bd7ce8db733681c9e83b6e,"Écosystèmes de transition par les communs, rencontre européenne en ligne le 4 Octobre 2022",,,,,,,,,"Non classifié(e)",,"14 septembre 2022"
Chargement/Site#_660ce3fdb576f3edc8612b2da0144e9a,"Digital Konbit",,,,"Biens communs",,,"Partage de connaissances",,"Tools,Projets passés et présents",,"16 janvier 2021"
Chargement/Site#_66c5cf8043b5be3dcfef759f6a7f866c,"No Tomorrow",,,,"Biens communs",,,"Partage de connaissances",,"Uncategorized,Entrevues,Projets passés et présents,Ressources",,"2 novembre 2020"
Chargement/Site#_68d717dccf529fef7de200f2e6e5e462,"Petits Déjeuners en-Commun au Sénégal",,,,,,,,,"Uncategorized,Projets passés et présents",,"4 février 2021"
Chargement/Site#_69c3bf69c73c3c8d89af60b129d768d8,"Barcelone en Comu : results before next step, the example of the Digital policy",,,,"Biens communs",,,"Partage de connaissances",,"Analysis,Projets passés et présents",,"4 février 2021"
Chargement/Site#_69d2d7783cb8e8ad095044fa7da5961b,"Catalunya en Comú: Construire un pays en commun(s)",,,,"Biens communs",,,"Partage de connaissances",,"Articles,Entrevues,Projets passés et présents,Ressources",,"4 février 2021"
Chargement/Site#_69d3573f06cb937aa5fcae8468acf982,"L’Art de l’en-commun",,,,"Biens communs",,,"Partage de connaissances",,"Articles,Projets complétés,Projets passés et présents,Ressources",,"4 février 2021"
Chargement/Site#_69ee90fe19a6709c3ca8d55ca9c94209,"Screening – debate: Commons in the political space",,,,"Biens communs",,,"Partage de connaissances",,"Uncategorized,Outils,Ressources",,"2 novembre 2020"
Chargement/Site#_6a6cb8dbd4e059e0b12c88187ecd0b85,"Un chantier pour jouer avec les mots des biens communs",,,,,,,,,"Uncategorized,Projets passés et présents,Vidéos",,"30 août 2020"
Chargement/Site#_6aa7db8b32bab89e8b3b1c55e285fb01,"Culture, communauté, et collaboration: nouvelles pistes pour la protection du patrimoine autochtone",,,,,,,,,"Non classifié(e)",,"4 février 2021"
Chargement/Site#_6c5a6391029f6c6bdb30310e3beda5bd,"Culture, communauté, et collaboration: nouvelles pistes pour la protection du patrimoine autochtone",,,,,,,,,Uncategorized,,"4 février 2021"
Chargement/Site#_6d6e03deb09af43b813ff70b830254fc,"Une exposition pour découvrir les communs",,,,"Biens communs",,,"Partage de connaissances",,"Outils,Projets complétés,Projets passés et présents,Ressources",,"22 janvier 2022"
Chargement/Site#_6e3644cb51a71988002772f75ba64dcc,"Ndima – Cards Of TheF future",,,,,,,,,"Uncategorized,Vidéos",,"4 février 2021"
Chargement/Site#_6e6ceea188aaa8cf8e1721d18e75ee27,"Un chantier pour jouer avec les mots des biens communs",,,,,,,,,"Projets complétés,Projets passés et présents,Vidéos",,"30 août 2020"
Chargement/Site#_7039f4925451c35abd1745f481254905,"La boussole de Johannesburg et les Communs",,,,,,,,,"Articles,Ressources,Vidéos",,"27 août 2020"
Chargement/Site#_7092fd610d64a8da50a83cebd2549d05,"Le pouvoir subversif des communs D.Bollier et S.Helfrich (ECLM)",,,,,,,,,Actualité,,"9 novembre 2022"
Chargement/Site#_71d408209b79d6f35fb9074bc8639522,"BarCamp partage de rushes et de vidéo en biens communs",,,,,,,,,"Uncategorized,Projets passés et présents,Vidéos",,"14 janvier 2020"
Chargement/Site#_721fefee6e887bfc3c8639dd753b73cd,,,,,,,,,,,,
Chargement/Site#_722e0a8b624bb58a23bf152ed5ee4ba0,"Idea Camp 2017: Communities In Movement",,,,"Biens communs",,,"Partage de connaissances",,"Uncategorized,Ressources,Vidéos",,"2 novembre 2020"
Chargement/Site#_72a599022c86eacbbb28aa60b98d029f,"Un chantier pour jouer avec les mots des biens communs",,,,,,,,,"Uncategorized,Projets passés et présents,Vidéos",,"30 août 2020"
Chargement/Site#_733e47d28ae1338f2288b9994771a358,"À l’école des communs",,,,,,,,,"Uncategorized,Projets passés et présents",,"4 février 2021"
Chargement/Site#_7359173c3756d2071b498e511d9c1c03,,,,,"Biens communs",,,"Partage de connaissances",,,,
Chargement/Site#_73a7181369a7df1c23c02ebb3129b4b3,"Michel Bauwens – « En route vers de nouveaux territoires économiques » 3/4",,,,,,,,,"Non classifié(e),Projets passés et présents,Vidéos",,"30 août 2020"
Chargement/Site#_75cef8d7a82c0ec59a8177505a532a5c,"Atelier de rédaction d’articles sur les biens communs dans Wikipedia",,,,,,,,,"Non classifié(e),Vidéos",,"4 février 2021"
Chargement/Site#_772b84797898e8bb1b59e49047d6b89c,"Chartes de gouvernance",,,,,,,,,"Uncategorized,Projets passés et présents",,"4 février 2021"
Chargement/Site#_77a7533e03bbc63797f49862020e42bf,"Atelier de rédaction d’articles sur les biens communs dans Wikipedia",,,,,,,,,"Non classifié(e),Vidéos",,"4 février 2021"
Chargement/Site#_77bdf01f244b604567ff60a72ff7b9c4,"Hosting the Commons",,,,,,,,,"Non classifié(e),Vidéos",,"7 décembre 2019"
Chargement/Site#_78a403882901e8c49fca70674a9eff91,"Commons Josaphat, To Do The City (Of Brussels) in common !",,,,"Biens communs",,,"Partage de connaissances",,"Uncategorized,Ressources",,"2 novembre 2020"
Chargement/Site#_796cb4c174e500de32d240455c6a4e20,"Les communs à l’ordre du jour planétaire",,,,,,,,,"Dossiers,Projets complétés,Projets passés et présents",,"4 février 2021"
Chargement/Site#_7aa04ad0b29f8e18ecb9c19c3d1bbc26,"Wa(te)rdrops, un projet de documentaire sur les luttes autour de l’eau en Grèce",,,,,,,,,"Non classifié(e),Vidéos",,"30 août 2020"
Chargement/Site#_7b04358464e78f83a35c03793c5ad96e,"Glasgow contre Glasgow",,,,,,,,,Vidéos,,"4 février 2021"
Chargement/Site#_7b21ecaf2465eb8b79e0889ad06b44e2,,,,,"Biens communs",,,"Partage de connaissances",,,,
Chargement/Site#_7ba1a74a85f0f9479e3392c854377a67,,,,,"Biens communs",,,"Partage de connaissances",,,,
Chargement/Site#_7cbe41b5c1bff10cd0592058f9b4ed8c,"Define The Commons #5",,,,,,,,,"Uncategorized,Projets passés et présents,Vidéos",,"4 février 2021"
Chargement/Site#_7e0ef7cfd41f9c72814c878824affb09,"Ndima – Cards Of TheF future",,,,,,,,,"Uncategorized,Vidéos",,"4 février 2021"
Chargement/Site#_7feed66edd3fb34c9dd231ee869f8225,"Bénin bien commun",,,,,,,,,"Non classifié(e),Projets passés et présents,Vidéos",,"7 décembre 2019"
Chargement/Site#_815b96d0fcd51e5c8b248934097250b0,"Ce que nous nous apprend l’histoire du Boléro de Ravel",,,,"Biens communs",,,"Partage de connaissances",,"Dossiers,Ressources,Vidéos",,"4 février 2021"
Chargement/Site#_81b558c76d82ee82592993cae7631551,"Commons Call",,,,"Biens communs",,,"Partage de connaissances",,"Resources,Tools,Projets passés et présents",,"4 février 2021"
Chargement/Site#_824da1084a60cce314c56603cf287c34,"Valuing natural capital or devaluing nature?",,,,,,,,,"Uncategorized,Vidéos",,"2 novembre 2020"
