Titre,TitreBlogue,Extrait,Catégorie,"Type de document","Catégorie Hess",Enjeu,"Action du type",Résultat,"URL de l'article","Catégorie d'article","Date de modification","Date de dernière modification"
Chargement/Site#_82c82876746516f2d906be380a9ae2aa,"Soustainable Fishing In Meditarranean Sea",,,,,,,,,Uncategorized,,"4 février 2021"
Chargement/Site#_8305fa5ea5cc5ff57a2dbd0a879ded78,"NDDL : Non à la violence  de l’Etat contre les communs !",,,,"Biens communs",,,"Partage de connaissances",,"Articles,Projets passés et présents",,"30 août 2020"
Chargement/Site#_8494c9880299bea6bd525e363753131f,"Marianne Knuth, founder of Kafunda Village",,,,,,,,,Uncategorized,,"4 février 2021"
Chargement/Site#_8571e8eaa75939237f423310ad9c2915,"Itinéraires en Biens Communs",,,,,,,,,"Uncategorized,Projets passés et présents",,"4 février 2021"
Chargement/Site#_861259498f5f59f785c7c43197fef7c5,"Valuing natural capital or devaluing nature?",,,,,,,,,"Uncategorized,Vidéos",,"2 novembre 2020"
Chargement/Site#_863746fc1dd641f99f9b8ab7612824b9,"Land Rush",,,,"Biens communs",,,"Partage de connaissances",,"Uncategorized,Projets complétés,Projets passés et présents,Ressources",,"4 février 2021"
Chargement/Site#_86a4a58602933f29f8baf261882a86f4,"Michel Bauwens, vers une société de la connaissance comme bien commun",,,,"Biens communs",,,"Partage de connaissances",,"Articles,Entrevues,Projets passés et présents,Ressources",,"8 février 2021"
Chargement/Site#_86cdafdee8b69ddf4f129cf117d6dbcb,"Philippe Minard : War Of The Forests And The Commons",,,,,,,,,"Uncategorized,Vidéos",,"4 février 2021"
Chargement/Site#_86fb8c9210a0cc365ff1372e073139b6,,,,,"Biens communs",,,"Partage de connaissances",,,,
Chargement/Site#_885f56a1acfc959f48d39843402060b8,"Commons And Populare Education, Experience Sharing And Perspectives",,,,,,,,,"Uncategorized,Vidéos",,"2 novembre 2020"
Chargement/Site#_8871d2cc0640ea6bc0ab039e3d9012a4,"Idea Camp 2017: Communautés en mouvement",,,,"Biens communs",,,"Partage de connaissances",,"Non classifié(e),Ressources,Vidéos",,"7 décembre 2019"
Chargement/Site#_888c31e80a9febacb57daf50644014d0,"Remix the commons At The French National Library",,,,,,,,,"Projects,Projects completed,Vidéos",,"4 février 2021"
Chargement/Site#_88dde92b9700a7f7c23a3406f2a346c4,"Commons Economy Rising",,,,,,,,,"Non classifié(e),Vidéos,Projets passés et présents",,"26 août 2020"
Chargement/Site#_89a8a21b34989803cd5411fab3618926,"Atlas Of Charters Of Urban Commons",,,,"Biens communs",,,"Partage de connaissances",,"Analysis,Projects,Projects completed,Ressources",,"4 février 2021"
Chargement/Site#_8a9689cfadc39a1b6ccc44e5bb08f14a,,,,,"Biens communs",,,"Partage de connaissances",,,,
Chargement/Site#_8b3a72bf93e8a76d52392332788f024a,,,,,"Biens communs",,,"Partage de connaissances",,,,
Chargement/Site#_8c3de0c4e91de526d6c0d803ee4a2f7d,,,,,"Biens communs",,,"Partage de connaissances",,,,
Chargement/Site#_8cbce642cfce5f0a676c960e0f2941bc,,,,,"Biens communs",,,"Partage de connaissances",,,,
Chargement/Site#_8cc671ba3bfa48520efb106a266463e9,,,,,"Biens communs",,,"Partage de connaissances",,,,
Chargement/Site#_8d7847b892ef96a50440ad97317eb4d4,"The Promise of « Open Cooperativism » by David Bollier",,,,"Biens communs",,,"Partage de connaissances",,"Analysis,Projets complétés,Projets passés et présents,Ressources",,"4 février 2021"
Chargement/Site#_8dfcf0d868c889e97fcb7ba0384fb145,"Culture in the city: the chalenges of a cultural policy",,,,"Biens communs",,,"Partage de connaissances",,"Analysis,Interviews",,"4 février 2021"
Chargement/Site#_8e10f1c3eb95cfa8610f95ed819e4e77,"Sacred Economics avec Charles Eisenstein – Un court métrage",,,,,,,,,"Vidéos,Projets passés et présents",,"30 août 2020"
Chargement/Site#_8e98c1afae85f5bf11efb00f32d45406,"Définir les biens communs #3",,,,,,,,,"Projets complétés,Projets passés et présents,Vidéos",,"4 février 2021"
Chargement/Site#_8f8fb58bb90d369050876e9c4b8af8a0,"Wa(te)rdrops, un projet de documentaire sur les luttes autour de l’eau en Grèce",,,,,,,,,"Uncategorized,Vidéos",,"14 janvier 2020"
Chargement/Site#_8f9a4846c23a284fe8f8942a5c1dba2b,,,,,"Biens communs",,,"Partage de connaissances",,,,
Chargement/Site#_8fd0829e9f1efc07fe9f16ec032afbfa,"Intégrer le paradigme des communs de la connaissance dans l’action et les politiques pour la transition",,,,"Biens communs",,,"Partage de connaissances",,"Non classifié(e),Projets complétés,Projets passés et présents,Ressources",,"4 février 2021"
Chargement/Site#_9007795542c6fee1b5cc0881a137d18c,"Commons Economy Rising",,,,,,,,,"Non classifié(e),Vidéos,Projets passés et présents",,"26 août 2020"
Chargement/Site#_90784ff25182f1072a038d2c63e8266c,"NDDL: No to State Violence Under Commons!",,,,"Biens communs",,,"Partage de connaissances",,"Analysis,Projets passés et présents",,"4 février 2021"
Chargement/Site#_91029d72944941b504445f32078ab41f,"Michel Bauwens – « En route vers de nouveaux territoires économiques » 3/4",,,,,,,,,"Uncategorized,Projets passés et présents,Vidéos",,"30 août 2020"
Chargement/Site#_9155eeb1ac4a9342dd6795c5684df46d,,,,,,,,,,,,
Chargement/Site#_91c422166ac14ee7056e3970cc87719c,"Petits Déjeuners en-Commun au Sénégal",,,,,,,,,"Projets complétés,Projets passés et présents",,"4 février 2021"
Chargement/Site#_9455b20e8e0320dacdcbca90ba551b0d,"Remix Biens Communs à la Bibliothèque Nationale de France",,,,,,,,,"Projets complétés,Projets passés et présents,Vidéos",,"4 février 2021"
Chargement/Site#_9510b75c0f099e27c753380818381544,,,,,"Biens communs",,,"Partage de connaissances",,,,
Chargement/Site#_9609d93bff6e7f66f6a1c321c2f8c9d3,"Elinor Ostrom sharing her vision of IASC",,,,,,,,,"Uncategorized,Projets passés et présents",,"2 novembre 2020"
Chargement/Site#_9644657db172318195c2248abb2fd986,"Soustainable Fishing In Meditarranean Sea",,,,,,,,,Uncategorized,,"4 février 2021"
Chargement/Site#_96719840571802d2803a6d0a1a54a752,,,,,,,,,,,,
Chargement/Site#_9740b312307da98b234e082d04aef3b9,"Définir les communs sur une carte",,,,,,,,,"Projets complétés,Projets passés et présents",,"27 août 2020"
Chargement/Site#_97d10a7e2ccf9c510c1abf1c1a9c7cf7,"Marianne Knuth, founder of Kafunda Village",,,,,,,,,Entrevues,,"4 février 2021"
Chargement/Site#_97d399f04414e8b480635e1890f49203,"Mapping the commons",,,,,,,,,"Non classifié(e),Projets passés et présents,Vidéos",,"7 décembre 2019"
Chargement/Site#_98c239bd0206e3702db37754bcd2fc70,,,,,"Biens communs",,,"Partage de connaissances",,,,
Chargement/Site#_98c97cdbde7dd136b65f1bd109f7cdbc,"Remix the commons At The French National Library",,,,,,,,,"Projects,Projects completed,Vidéos",,"4 février 2021"
Chargement/Site#_99556d35b45de43ed7e761957b712d36,"Glasgow contre Glasgow",,,,,,,,,Videos,,"4 février 2021"
Chargement/Site#_9b0665c605bc89f0f2af8f3d60194452,,,,,"Biens communs",,,"Partage de connaissances",,,,
Chargement/Site#_9b4be7320c8a930a3dbe9a3a21987f89,"Les communs urbains, l’un des piliers du projet politique de la décennie",,,,"Biens communs",,,"Partage de connaissances",,"Articles,Vidéos",,"4 février 2021"
Chargement/Site#_9bb2fab1d75601aa50f8d7bf7e8e2063,"Hosting the Commons",,,,,,,,,"Uncategorized,Vidéos",,"14 janvier 2020"
Chargement/Site#_9bc50696b060e85a75d5e43a576eed3e,"Les Communs face à la répression en Catalogne.",,,,"Biens communs",,,"Partage de connaissances",,"Non classifié(e),Projets passés et présents",,"7 décembre 2019"
Chargement/Site#_9d5b00ca41720d1679fc2f4ee6b2bed9,"Define The Commons #4",,,,,,,,,"Uncategorized,Projets passés et présents,Vidéos",,"4 février 2021"
Chargement/Site#_9f068265402a268a101a51587ffb4719,"Justice transitionnelle: l’expérience Marocaine",,,,,,,,,"Projets complétés,Projets passés et présents,Vidéos",,"27 août 2020"
Chargement/Site#_9f4b4c6fce02b18a81e4eba722dda65b,"Define The Commons #4",,,,,,,,,"Uncategorized,Projets passés et présents,Vidéos",,"4 février 2021"
Chargement/Site#_9fe085e8af77428a12315e6069089567,"Revendiquer les Communs – Nourriture pour tous à Haultain Boulevard",,,,,,,,,"Entrevues,Vidéos,Projets passés et présents",,"30 août 2020"
