Titre,TitreBlogue,Extrait,Catégorie,"Type de document","Catégorie Hess",Enjeu,"Action du type",Résultat,"URL de l'article","Catégorie d'article","Date de modification","Date de dernière modification"
Chargement/Site#_a278a50b30980a5e7175f22f5e01af37,"Define The Commons #5",,,,,,,,,"Uncategorized,Projets passés et présents,Vidéos",,"4 février 2021"
Chargement/Site#_a2a6079493032cc2f76344ef6ef2d6b9,"Itinéraires en Biens Communs",,,,,,,,,"Projets complétés,Projets passés et présents",,"4 février 2021"
Chargement/Site#_a3b5bbaf5b13e72f53b8d6b8b9defe5f,"CommonsCamp – Grenoble 2018",,,,"Biens communs",,,"Partage de connaissances",,"Non classifié(e),Projets complétés,Projets passés et présents",,"4 février 2021"
Chargement/Site#_a3d58f8c9e096609ee332d6a9087ee90,"Commons And Populare Education, Experience Sharing And Perspectives",,,,,,,,,"Uncategorized,Vidéos",,"2 novembre 2020"
Chargement/Site#_a6cacf5eca8005542bf6611f9a75782a,"Projection-débat : Les communs dans l’espace politique",,,,"Biens communs",,,"Partage de connaissances",,"Non classifié(e),Outils,Ressources",,"7 décembre 2019"
Chargement/Site#_a6f815c25275ace34514092f872913a1,,,,,,,,,,,,
Chargement/Site#_a7e15679cd6f59be143d8801bfa754ee,"Droits en Biens Communs",,,,,,,,,"Projets complétés,Projets passés et présents",,"4 février 2021"
Chargement/Site#_a87a4588687dc3f44b2daa80c9deba3f,"Les déjeuners des Communs de Montréal",,,,,,,,,"Uncategorized,Projets complétés,Projets passés et présents",,"30 août 2020"
Chargement/Site#_a91300958985c39940023941ed781b2a,,,,,"Biens communs",,,"Partage de connaissances",,,,
Chargement/Site#_aa8688082d1f4f265007bff87c75cb63,"Commons Space In The World Social Forum,  Montréal 2016",,,,"Biens communs",,,"Partage de connaissances",,"Uncategorized,Ressources,Vidéos",,"2 novembre 2020"
Chargement/Site#_ab469fe3a849ea125a9826f530800e79,"Philippe Minard : la Guerre des Forêts et les communs",,,,,,,,,"Entrevues,Vidéos",,"4 février 2021"
Chargement/Site#_ac1d7b7193426ad94fff6aafaca2c858,"SACRÉE CROISSANCE !",,,,"Biens communs",,,"Partage de connaissances",,"Non classifié(e),Projets complétés,Projets passés et présents,Ressources",,"4 février 2021"
Chargement/Site#_ac2e5a7a40a87dbf1c16661680d3d98f,"ATELIER : Création d’un Atlas des chartes des communs urbains",,,,"Biens communs",,,"Partage de connaissances",,"Non classifié(e),Ressources,Vidéos",,"7 décembre 2019"
Chargement/Site#_aece8a5c00e855d5ab44e51206e1baff,"Elinor Ostrom partage sa vision sur l’IASC",,,,,,,,,"Entrevues,Projets passés et présents",,"2 novembre 2020"
Chargement/Site#_b215973a7c6fb71411331a992ef3747d,"Valoriser le capital naturel ou dévaluer la nature ?",,,,,,,,,"Non classifié(e),Vidéos",,"30 août 2020"
Chargement/Site#_b341dfa3a2581fd8558387e65119b178,"À l’école des communs",,,,,,,,,"Non classifié(e),Projets passés et présents",,"4 février 2021"
Chargement/Site#_b34d7494fd153cb9ef0e50e8cb0d45e5,,,,,,,,,,,,
Chargement/Site#_b391cb9ada5736375b01f23ae27f8886,"Ndima – Les cartes de notre futur",,,,,,,,,"Non classifié(e),Vidéos",,"4 février 2021"
Chargement/Site#_b4103f1bf8f2b7649b0d2f3c9c1310cd,"Petits Déjeuners en-Commun au Sénégal",,,,,,,,,"Projets complétés,Projets passés et présents",,"4 février 2021"
Chargement/Site#_b44cce182e687535a64407637a5756ff,"Montréal, premier rendez-vous A l’école des communs.",,,,,,,,,"Projets complétés,Projets passés et présents",,"30 août 2020"
Chargement/Site#_b45ee888f25715c17291508c5b27ca61,"Passerelle « Finance et communs »",,,,"Biens communs",,,"Partage de connaissances",,"Non classifié(e),Ressources",,"29 mars 2022"
Chargement/Site#_b4cc29ad40238d744d654bfd7055a726,"Valoriser le capital naturel ou dévaluer la nature ?",,,,,,,,,"Non classifié(e),Vidéos",,"30 août 2020"
Chargement/Site#_b4cfc0135841287b61bf042841cc9ec5,"FLOK Society, A Research Project For The Transition In Ecuador",,,,,,,,,"Uncategorized,Projets passés et présents,Vidéos",,"2 novembre 2020"
Chargement/Site#_b5c19ae0f06b249c49c50ad779b9f5f8,,,,,,,,,,,,
Chargement/Site#_b7741f2acd96c93e5173b2921f6a5162,"Revendiquer les Communs – Nourriture pour tous à Haultain Boulevard",,,,,,,,,"Uncategorized,Entrevues,Projets passés et présents",,"30 août 2020"
Chargement/Site#_b84d047b5264e8558ce9094be4b70243,"Glasgow contre Glasgow",,,,,,,,,Vidéos,,"4 février 2021"
Chargement/Site#_b8529ee9236cc16467ebe9a058ee9cb6,"Horizons communs",,,,"Biens communs",,,"Partage de connaissances",,"Projets complétés,Projets passés et présents",,"15 janvier 2022"
Chargement/Site#_b9de3fe805ebddd944a46fb184417cf2,"C@rds In Commons : Learn From The Commons By Playing",,,,"Biens communs",,,"Partage de connaissances",,"Tools,Uncategorized,Ressources",,"27 décembre 2020"
Chargement/Site#_bab1f95110c248d9144beb1dd00e3464,,,,,"Biens communs",,,"Partage de connaissances",,,,
Chargement/Site#_bacffb10c96ac0b159ae0f8618097696,"Michel Bauwens – « En route vers de nouveaux territoires économiques » 3/4",,,,,,,,,"Uncategorized,Projets passés et présents,Vidéos",,"30 août 2020"
Chargement/Site#_bb11f6321952caa121a8b40c3f561ad3,"Définir les biens communs #2",,,,,,,,,"Projets complétés,Projets passés et présents,Vidéos",,"26 août 2020"
Chargement/Site#_bbb89cd7688f013585e7702f7f7d2e8a,"The Forest Charter, 800 Years Old",,,,"Biens communs",,,"Partage de connaissances",,"Analysis,Projets passés et présents",,"4 février 2021"
Chargement/Site#_bbc06442b58792ae76d17afdf8bf3b44,"La terre de l’autre – Interviews d’Étienne Le Roy",,,,,,,,,"Entrevues,Vidéos",,"4 février 2021"
Chargement/Site#_bcb55cf697090bb0afc4c06e468732e4,,,,,"Biens communs",,,"Partage de connaissances",,,,
Chargement/Site#_c0366ea1fa85f24ed086da2358e9a06d,,,,,"Biens communs",,,"Partage de connaissances",,,,
Chargement/Site#_c12c20fe97212f6e439f804e544bdb16,Cecosesola,,,,"Biens communs",,,"Partage de connaissances",,"Non classifié(e),Projets complétés,Projets passés et présents,Ressources",,"22 février 2021"
Chargement/Site#_c1ce97e5af93b4511c6d9cbed754d068,"We Are Legion: The Story of the Hactivists – Trailer",,,,,,,,,"Uncategorized,Projets passés et présents",,"30 août 2020"
Chargement/Site#_c1fa9b88c17075f686255630447d1f4e,"Rick Wolff: les coopératives pour se guérir du capitalisme Video : 6min",,,,,,,,,Uncategorized,,"4 février 2021"
Chargement/Site#_c2cd77f55437afa6228adf1411a4c8ee,"The London Orchard Project on Vimeo",,,,,,,,,"Vidéos,Projets passés et présents",,"2 novembre 2020"
Chargement/Site#_c2d7784ab3e03c7745baa2dd0d7ed28f,"The London Orchard Project on Vimeo",,,,,,,,,"Vidéos,Projets passés et présents",,"2 novembre 2020"
Chargement/Site#_c30254aa074dd383888359b19866adba,"Commons Economy Rising",,,,,,,,,"Uncategorized,Vidéos,Projets passés et présents",,"14 janvier 2020"
Chargement/Site#_c716c82bcd22b44ece3cfb7c6ca2aea8,"New Vidéos That Explore The Political Potential of Commons",,,,"Biens communs",,,"Partage de connaissances",,"Uncategorized,Entrevues,Projets passés et présents,Ressources",,"2 novembre 2020"
Chargement/Site#_c76c62994c12a6242e749d60808d27dd,"Justice transitionnelle: l’expérience Marocaine",,,,,,,,,"Uncategorized,Projets passés et présents,Vidéos",,"14 janvier 2020"
Chargement/Site#_c7cba3afe675aa1e6b547fe61279ee25,,,,,"Biens communs",,,"Partage de connaissances",,,,
Chargement/Site#_c7f22ed2ff3767fdc3d876b1405773bf,"Hosting the Commons",,,,,,,,,"Uncategorized,Vidéos",,"14 janvier 2020"
Chargement/Site#_c82fbe80308240c74654129ff134ae51,"Nouvelles alliances pour la reconnaissance des communs",,,,"Biens communs",,,"Partage de connaissances",,"Articles,Non classifié(e)",,"10 janvier 2022"
Chargement/Site#_c90f60c067807db5428d4dc02763e74f,"Marianne Knuth, founder of Kafunda Village",,,,,,,,,Entrevues,,"4 février 2021"
Chargement/Site#_c987eed2390760f240783417e5f9278e,"Revendiquer les Communs – Nourriture pour tous à Haultain Boulevard",,,,,,,,,"Uncategorized,Entrevues,Projets passés et présents",,"30 août 2020"
Chargement/Site#_cb485c3c2160dd65a34bc7dabb1a6980,"Ndima – Les cartes de notre futur",,,,,,,,,"Non classifié(e),Vidéos",,"4 février 2021"
Chargement/Site#_cb6c9c8cd10b0f30740f4adab609cc84,"La révolution des communs et le droit",,,,"Biens communs",,,"Partage de connaissances",,"Outils,Ressources",,"24 août 2022"
