Titre,TitreBlogue,Extrait,Catégorie,"Type de document","Catégorie Hess",Enjeu,"Action du type",Résultat,"URL de l'article","Catégorie d'article","Date de modification","Date de dernière modification"
Chargement/Site#_cb8b635851b3ac8d350fa93566e697e6,"Sans lendemain",,,,"Biens communs",,,"Partage de connaissances",,"Vidéos,Entrevues,Projets passés et présents,Ressources",,"30 août 2020"
Chargement/Site#_cc07c3627886243c7fecee0acb73fde5,"Charte de la Forêt, 800 ans",,,,"Biens communs",,,"Partage de connaissances",,"Articles,Projets passés et présents",,"4 février 2021"
Chargement/Site#_cd20e30b1bc99ae32856bf5ab36dd41d,"Define The Commons In The Map",,,,,,,,,"Uncategorized,Vidéos",,"2 novembre 2020"
Chargement/Site#_ce4ba001a11b3a4434bee6e04a3b42b4,"Tous commoners",,,,,,,,,"Non classifié(e),Entrevues,Projets passés et présents",,"22 février 2021"
Chargement/Site#_cea182525746a197353f84093c5e7327,"Un chantier pour jouer avec les mots des biens communs",,,,,,,,,"Projets complétés,Projets passés et présents,Vidéos",,"30 août 2020"
Chargement/Site#_d0d01377ea13d8ca77d76017f94b5a9c,"Espace des Communs, dans le cadre du Forum Social Mondial,  Montréal 2016",,,,"Biens communs",,,"Partage de connaissances",,"Non classifié(e),Ressources,Vidéos",,"7 décembre 2019"
Chargement/Site#_d19405f1b1aaad88acff4424ed08a301,,,,,"Biens communs",,,"Partage de connaissances",,,,
Chargement/Site#_d2010e750699141f97fb0b906dbbf2a9,"Culture, commauté, et collaboration: de nouvelles voies pour la protection du patrimoine culturel ancestral",,,,"Biens communs",,,"Partage de connaissances",,"Articles,Vidéos,Projets passés et présents,Ressources",,"4 février 2021"
Chargement/Site#_d399c7d9efc63be34d2ae5da4a0b9ca8,"Atlas of the Charters of the Urban Commons",,,,"Biens communs",,,"Partage de connaissances",,"Projects completed,Projets passés et présents",,"8 février 2021"
Chargement/Site#_d6de32d2bd241c49e1870302dec71edf,,,,,"Biens communs",,,"Partage de connaissances",,,,
Chargement/Site#_d79751a6de8d737970b8511bacbec802,"Maritime Routes",,,,"Biens communs",,,"Partage de connaissances",,"Uncategorized,Projets complétés,Projets passés et présents,Ressources",,"2 novembre 2020"
Chargement/Site#_d801a42ad73b10a83f18c45795432b4e,"Commons Josaphat, faire la ville (de Bruxelles) en commun !",,,,"Biens communs",,,"Partage de connaissances",,"Non classifié(e),Ressources",,"7 décembre 2019"
Chargement/Site#_d93e45170607f7db0760ccd1ba3da17b,"Itinéraires en Biens Communs",,,,,,,,,"Projets complétés,Projets passés et présents",,"4 février 2021"
Chargement/Site#_d9705605c76b9ce631c69654c5cb0b1a,"Stop, Thief!: The Commons, Enclosures, and Resistance (PM Press)",,,,,,,,,"Non classifié(e),Vidéos",,"4 février 2021"
Chargement/Site#_d9b6d1890d6c9c134efd10be6cadcf1c,"Define The Commons #2",,,,,,,,,"Uncategorized,Projets passés et présents,Vidéos",,"2 novembre 2020"
Chargement/Site#_da55eca172c057d040fde0c30a9fe8be,,,,,"Biens communs",,,"Partage de connaissances",,,,
Chargement/Site#_db1b58a92befc2803f3a598d8b7553a2,"Tragedies, comedies and other dramas of the Commons by Bonnie McCay #IASC #Japan2013",,,,,,,,,"Uncategorized,Projets passés et présents,Vidéos",,"4 février 2021"
Chargement/Site#_db217d90162d9a03904ba8c558513f1d,"C@rtes en commun, passez votre commande !",,,,"Biens communs",,,"Partage de connaissances",,"Non classifié(e),Ressources",,"7 décembre 2019"
Chargement/Site#_dd1b58563a561917d250af43965aecf0,"Rick Wolff: les coopératives pour se guérir du capitalisme Video : 6min",,,,,,,,,Uncategorized,,"4 février 2021"
Chargement/Site#_dd2e5d16d984f92a992114b45d989bd6,,,,,"Biens communs",,,"Partage de connaissances",,,,
Chargement/Site#_dd309e63e5f8d265d0dadac9fcc55176,"Définir les biens communs #3",,,,,,,,,"Projets complétés,Projets passés et présents,Vidéos",,"4 février 2021"
Chargement/Site#_ddf378c8680cc4a0f2dfc1abbe3d8708,"Commons Economy Rising",,,,,,,,,"Uncategorized,Vidéos,Projets passés et présents",,"14 janvier 2020"
Chargement/Site#_de328f8eee33ba03fcf57d818d8017f4,,,,,"Biens communs",,,"Partage de connaissances",,,,
Chargement/Site#_de407e4e127c51ee2ed5383cbfebd306,"Wa(te)rdrops, un projet de documentaire sur les luttes autour de l’eau en Grèce",,,,,,,,,"Uncategorized,Vidéos",,"14 janvier 2020"
Chargement/Site#_de6578776be1d890d0ea18bdaee465c9,"« Jusqu’où tu es chez toi ? » Petit déjeuner en Commun à Kédougou",,,,,,,,,"Non classifié(e),Projets passés et présents",,"7 décembre 2019"
Chargement/Site#_de67b8db9c95253b9d50c4bea3b78705,,,,,"Biens communs",,,"Partage de connaissances",,,,
Chargement/Site#_df3628d1d55ca76105120dfd6b441081,"Catalunya en Comú: To Built A Country As Commons",,,,"Biens communs",,,"Partage de connaissances",,"Analysis,Interviews,Projets passés et présents,Ressources",,"4 février 2021"
Chargement/Site#_e14e7f3904fffab0e72528b337a65498,"Michel Bauwens, towards a society of knowledge as commons",,,,"Biens communs",,,"Partage de connaissances",,"Analysis,Interviews,Projets passés et présents,Ressources",,"15 janvier 2022"
Chargement/Site#_e23cc9ee61992df97377a390477e8f2e,"Will Work For Free",,,,"Biens communs",,,"Partage de connaissances",,"Uncategorized,Projets complétés,Projets passés et présents,Ressources",,"4 février 2021"
Chargement/Site#_e336510a10f93cdcb79f3644e34fb4f5,"Commons.hour at meet.coop",,,,"Biens communs",,,"Partage de connaissances",,"Non classifié(e),Projets passés et présents",,"19 octobre 2021"
Chargement/Site#_e47bcbedda776b2a42cda6d91ff4147b,"Remix Biens Communs présenté sur Revista Pillku",,,,,,,,,"Uncategorized,Projets passés et présents",,"30 août 2020"
Chargement/Site#_e502851e4912a9db0e3cff4b9d400c9b,"La boussole de Johannesburg et les Communs",,,,,,,,,"Uncategorized,Ressources,Vidéos",,"14 janvier 2020"
Chargement/Site#_e8bc207d8433faf13a57a49ffa071c65,"Mapping the commons",,,,,,,,,"Uncategorized,Projets passés et présents,Vidéos",,"14 janvier 2020"
Chargement/Site#_e97dd65e6295875f2c6aa919e92f7cdf,"Politiques des communs dans le contexte municipal",,,,"Biens communs",,,"Partage de connaissances",,"Dossiers,Ressources",,"15 janvier 2022"
Chargement/Site#_ea0308457808827b883abeef6499e1c4,"Assemblée Européenne des communs au Medialab Prado",,,,"Biens communs",,,"Partage de connaissances",,"Non classifié(e),Projets passés et présents",,"7 décembre 2019"
Chargement/Site#_ea4ddbaf7a36a6c5aa50b229ac479ce1,,,,,"Biens communs",,,"Partage de connaissances",,,,
Chargement/Site#_ea6ad2665b85635e93065707dc384879,"BarCamp partage de rushes et de vidéo en biens communs",,,,,,,,,"Uncategorized,Projets passés et présents,Vidéos",,"14 janvier 2020"
Chargement/Site#_eb69a3afbeefadf52624b12600f26946,"Chartes de gouvernance",,,,,,,,,"Non classifié(e),Projets passés et présents",,"4 février 2021"
Chargement/Site#_ec3fc292b0467a767440f5889018811c,"Médias et transition un débat le 8 octobre au Goethe-Institut",,,,"Biens communs",,,"Partage de connaissances",,"Non classifié(e),Ressources,Vidéos",,"7 décembre 2019"
Chargement/Site#_ec4743268d932f9ccc8db7a091e3b79e,"Culture, Community, And Collaboration: New Routes For The Protection Of The Ancestral Cultural Patrimony",,,,"Biens communs",,,"Partage de connaissances",,"Analysis,Videos,Projets passés et présents,Ressources",,"4 février 2021"
Chargement/Site#_ed9af1b9d42a32d67498c0a6831f91f6,,,,,,,,,,,,
Chargement/Site#_ef075369d0950270bd50293ad3a5a043,"Sacred Economics avec Charles Eisenstein – Un court métrage",,,,,,,,,"Uncategorized,Vidéos,Projets passés et présents",,"30 août 2020"
Chargement/Site#_f0023bf00086487ae4630e3b6c15db03,"Festival de Chieri, jouer avec la grammaire des communs",,,,"Biens communs",,,"Partage de connaissances",,"Entrevues,Ressources,Vidéos",,"26 janvier 2022"
Chargement/Site#_f2724e35d921f065f93ec238f95bc17b,"Glasgow contre Glasgow",,,,,,,,,Videos,,"4 février 2021"
Chargement/Site#_f3e8d33f2287fdefc4930ee4ecfa1526,"Débat public : « Pour la Transition, une économie du partage de la connaissance et des biens communs. »",,,,"Biens communs",,,"Partage de connaissances",,"Non classifié(e),Projets complétés,Projets passés et présents,Ressources",,"4 février 2021"
Chargement/Site#_f4e9613b8fcb2308fdda6633097f100a,"Définir les biens communs #1",,,,,,,,,"Projets complétés,Projets passés et présents,Vidéos",,"26 août 2020"
Chargement/Site#_f4ead95e3df643362be87d6124a29876,"Culture dans la ville: les défis d’une politique culturelle.",,,,"Biens communs",,,"Partage de connaissances",,"Entrevues,Interviews",,"4 février 2021"
Chargement/Site#_f52243e5998ae6ab1c45294cc28c1501,"Définir les biens communs #4",,,,,,,,,"Projets complétés,Projets passés et présents,Vidéos",,"4 février 2021"
Chargement/Site#_f610e38c8a51e8582d87a3f708b5fdc0,"Coming soon : European Commons Assembly",,,,"Biens communs",,,"Partage de connaissances",,"Uncategorized,Ressources",,"2 novembre 2020"
Chargement/Site#_f62ab6943a16b71c23d4cc6108270896,"BarCamp partage de rushes et de vidéo en biens communs",,,,,,,,,"Non classifié(e),Projets passés et présents,Vidéos",,"7 décembre 2019"
