Titre,TitreBlogue,Extrait,Catégorie,"Type de document","Catégorie Hess",Enjeu,"Action du type",Résultat,"URL de l'article","Catégorie d'article","Date de modification","Date de dernière modification"
"Définir les communs - Miguel Said Vieira",,,"Catégorie:Objet média",Vidéo,,"Définir les communs,Partage",,,,,"13 décembre 2022",
"Définir les communs - Mike Linskvayer",,,"Catégorie:Objet média",Vidéo,,"Définir les communs,Liberté,Communauté",,,,,"12 novembre 2017",
"Définir les communs - Monique Chartrand",,,"Catégorie:Objet média",Vidéo,,"Définir les communs,Co-gestion",,,,,"9 novembre 2017",
"Définir les communs - Nicole Alix",,,"Catégorie:Objet média",Vidéo,,"Définir les communs,Genre,Co-gestion",,,,,"13 décembre 2022",
"Définir les communs - Noël Vale Valera",,,"Catégorie:Objet média",Vidéo,,"Justice,Genre,Solidarité",,,,,"12 novembre 2017",
"Définir les communs - Pat Conaty",,,"Catégorie:Objet média",Vidéo,,"Définir les communs",,,,,"13 décembre 2022",
"Définir les communs - Phlippe Aigrain",,,"Catégorie:Objet média",Vidéo,,"Définir les communs,Usus,Abusus,Fructus,Gouvernance de Remix the Commons,Droit de propriété",,,,,"13 décembre 2022",
"Définir les communs - Soma Kishore Parthasarathy",,,"Catégorie:Objet média",Vidéo,"Communs sociaux","Définir les communs,Gestion durable,Partage,Confiance",,,,,"13 décembre 2022",
"Définir les communs - Tomislav Tomasevic",,,"Catégorie:Objet média",Vidéo,,"Définir les communs,Buen vivir,Équité,Justice",,,,,"13 décembre 2022",
"Définir les communs - Valérie Peugeot, France",,,"Catégorie:Objet média",Vidéo,"Communs sociaux","Propriété collective,Définir les communs,En-commun,Droit des communs",,,,,"13 décembre 2022",
"Définir les communs selon Kamira Naït Sid",,,"Catégorie:Objet média",Audio,"Communs traditionnels,Forêts,Occupation et utilisation des terres,Organisation villageoise et sociale,Pâturages","Accaparement des terres",,,,,"13 janvier 2019",
"Définir les Communs- Mohamed Leightas, Maroc",,,"Catégorie:Objet média",Vidéo,,"Définir les communs,Gestion durable,Communauté",,,,,"13 décembre 2022",
"Définir the communs - Smari Mc Carthy",,,"Catégorie:Objet média",Vidéo,,"Définir les communs,Collaboration,Intelligence collective",,,,,"10 février 2017",
"Définition des communs",,,"Catégorie:Collection,Catégorie:Objet média",Collection,,,,,,,"24 février 2024",
"Définition des communs à Pixelache 2014",,,"Catégorie:Collection,Catégorie:Objet média",Collection,,,,,,,"20 juin 2022",
"Définition des communs selon Abdou Salam Fall",,,"Catégorie:Objet média",Vidéo,,,,,,,"26 mars 2018",
"Définition des communs selon Adama Dembelé",,,"Catégorie:Objet média",Vidéo,,,,,,,"12 novembre 2017",
"Définition des communs selon Agnieszka Pokrywka",,,"Catégorie:Objet média",Vidéo,,,,,,,"28 janvier 2016",
"Définition des communs selon Alain Ambrosi",,,"Catégorie:Objet média",Vidéo,,,,,,,"10 novembre 2017",
"Définition des communs selon Alberto Acosta",,,"Catégorie:Objet média",Vidéo,,,,,,,"26 mars 2018",
"Définition des communs selon ANGA NINAWAMAN Chaska",,,"Catégorie:Objet média",Audio,,"Réciprocité,Travail collectif",,,,,"13 janvier 2019",
"Définition des communs selon Balász Bodó",,,"Catégorie:Objet média",Vidéo,,,,,,,"26 mars 2018",
"Définition des communs selon Beatriz Busaniche",,,"Catégorie:Objet média",Vidéo,,,,,,,"10 novembre 2017",
"Définition des communs selon Benjamin Coriat",,,"Catégorie:Objet média",Vidéo,,,,,,,"10 novembre 2017",
"Définition des communs selon Claire Brossaud",,,"Catégorie:Objet média",Vidéo,,,,,,,"10 novembre 2017",
"Définition des communs selon David Bollier",,,"Catégorie:Objet média",Vidéo,,,,,,,"10 novembre 2017",
"Définition des communs selon David Bollier (2013)",,,"Catégorie:Objet média",Vidéo,,"Définir les communs,Spiritualité",,,,,"10 novembre 2017",
"Définition des communs selon Erich Berger",,,"Catégorie:Objet média",Vidéo,,,,,,,"10 novembre 2017",
"Définition des communs selon Friederike Habermann",,,"Catégorie:Objet média",Vidéo,"Économies du don","Définir les communs,Partage,Usages",,,,,"12 novembre 2017",
"Définition des communs selon Gaelle Krikorian",,,"Catégorie:Objet média",Vidéo,,,,,,,"26 mars 2018",
"Définition des communs selon Gaelle Krikorian (2013)",,,"Catégorie:Objet média",Vidéo,,"Définir les communs,Solidarité",,,,,"12 novembre 2017",
"Définition des communs selon Georges Pór",,,"Catégorie:Objet média",Vidéo,,"Valeur,Définir les communs,Gouvernance de Remix the Commons,Auto-organisation",,,,,"12 novembre 2017",
"Définition des communs selon Guillaume Coulombe",,,"Catégorie:Objet média",Vidéo,,"Valeur,Définir les communs,Partage",,,,,"12 novembre 2017",
"Définition des communs selon Gwendolyn Hallsmith",,,"Catégorie:Objet média",Vidéo,,"Définir les communs,Collaboration,Partage",,,,,"12 novembre 2017",
"Définition des communs selon Hala Essalmawi",,,"Catégorie:Objet média",Vidéo,,,,,,,"12 novembre 2017",
"Définition des communs selon Heike Löschmann",,,"Catégorie:Objet média",Vidéo,,"Définir les communs,Démocratie,Participation",,,,,"12 novembre 2017",
"Définition des communs selon Hervé Le Crosnier",,,"Catégorie:Objet média",Vidéo,,"Définir les communs,Enclosure",,,,,"12 novembre 2017",
"Définition des communs selon Isabella Lovin",,,"Catégorie:Objet média",Vidéo,,,,,,,"14 décembre 2016",
"Définition des communs selon Mahdi Hajri",,,"Catégorie:Objet média",Vidéo,,,,,,,"12 novembre 2017",
"Définition des communs selon Markus Schmidt",,,"Catégorie:Objet média",Vidéo,,,,,,,"12 novembre 2017",
"Définition des communs selon Massimo Banzi",,,"Catégorie:Objet média",Vidéo,,,,,,,"10 novembre 2017",
"Définition des communs selon Michel Bauwens",,,"Catégorie:Objet média",Vidéo,,,,,,,"10 novembre 2017",
"Définition des communs selon Michel Bauwens (2013)",,,"Catégorie:Objet média",Vidéo,,,,,,,"10 novembre 2017",
"Définition des communs selon Miguel Vieira",,,"Catégorie:Objet média",Vidéo,,"Définir les communs",,,,,"12 novembre 2017",
"Définition des communs selon Mohamed Leghtas",,,"Catégorie:Objet média",Vidéo,,,,,,,"12 novembre 2017",
"Définition des communs selon Moussa Mbaye",,,"Catégorie:Objet média",Vidéo,,,,,,,"2 novembre 2016",
"Définition des communs selon Moussa Mbaye (Wolof)",,,"Catégorie:Objet média",Vidéo,,"Définir les communs",,,,,"14 décembre 2016",
"Définition des communs selon Myriam Bassi",,,"Catégorie:Objet média",Vidéo,,,,,,,"10 novembre 2017",
"Définition des communs selon Philippe Aigrain",,,"Catégorie:Objet média",Vidéo,,"Propriété collective",,,,,"26 mars 2018",
"Définition des communs selon Philippe Aigrain (2013) version longue",,,"Catégorie:Objet média",Vidéo,,"Définir les communs,Usus,Abusus,Fructus,Gouvernance de Remix the Commons,Droit de propriété",,,,,"13 décembre 2022",
